{"text_format":"1","workbook":"xlsx","n_sheets":11,"sheets":["Introduction ","Self assesment","Summary of actions ","Clinical Assesment ","Intervention and Rehabilitation","Governance and safety stadards ","Patient Centred Care ","Education ","Leadership ","Research ","Tables Lists "],"not_rendered":{"charts":16,"images":3,"macros":1,"external_links":0,"defined_names":40,"comments":0,"pivot_tables":7},"unopened":[],"bounds":{"document_bytes":16777216,"sheet_cells":100000,"rows_first":2000,"rows_last":500,"rows_between":2000,"halvings":0,"cell_chars":16384,"cell_head_chars":4096},"cells_cut":0,"cells_raw":0,"read":"whole","date_system":"1900"}

{"sheet":"Introduction ","index":0,"n_rows":33,"n_cols":19,"rows_kept":33,"cut":false,"hidden":false,"merged":[]}
[]
[]
[]
[]
[]
[]
[]
[]
[]
[]
{"$rows_left_out":24}
{"sheet":"Self assesment","index":1,"n_rows":74,"n_cols":15,"rows_kept":74,"cut":false,"hidden":false,"merged":[[0,1,2,12]]}
[null,"Self Assesment: "]
[]
[]
[]
[null,"Clinical Assesments ","Assesment 1 ","Assesmnet 2 ","Assesment 3 "]
[null,"Subjective history"]
[null,"Airway"]
[null,"Breathing"]
[null,"Circulation"]
[null,"Disability"]
{"$rows_left_out":65}
{"sheet":"Summary of actions ","index":2,"n_rows":151,"n_cols":9,"rows_kept":151,"cut":false,"hidden":false,"merged":[[0,0,3,10]]}
["Summary of actions "]
[]
[]
[]
[]
[]
[]
["Clinical Assesment "]
["Count of Capability statement ","Column Labels"]
["Row Labels","Supportive","Assistive","Foundation","Enhanced","Advanced","Consultant","Consultant ","Grand Total"]
{"$rows_left_out":142}
{"sheet":"Clinical Assesment ","index":3,"n_rows":372,"n_cols":13,"rows_kept":372,"cut":false,"hidden":false,"merged":[[0,0,2,10],[0,11,2,22]]}
["Clinical Assesment"]
[]
[]
[]
[]
[null,"Capability statement ","Area ","Level ","Profession","Complete ","Progress","Signed ","Dated","Evidence ","Evidence 2","Evidence 3","Evidence 4"]
[null,"Recognise information from patient notes, including reason for admission, past medical history, previous function, social history, languages spoken, impairments and adaptations, recognising when factors discovered could impact on treatment plans.","Subjective history","Supportive","All Professions",true,{"$f":"IF(Table5[[#This Row],[Complete ]],\"Complete\",\"Pending\")","v":"Complete"},null,"2025-10-07"]
[null,"Assess a patient's previous occupational abilities, roles, routines, values and interests and use the information to inform assessment and intervention.","Subjective history","Foundation","OT",true,{"$f":"IF(Table5[[#This Row],[Complete ]],\"Complete\",\"Pending\")","v":"Complete"},null,"2025-10-07"]
[null,"Apply findings from a holistic person-centred assessment, including a subjective history and interpret potential impact on intervention and management.","Subjective history","Foundation","All Professions",false,{"$f":"IF(Table5[[#This Row],[Complete ]],\"Complete\",\"Pending\")","v":"Pending"}]
[null,"Recognise airway compromise, escalating concerns to relevant multi-professional team members, and where required, ensure airway patency in line with the level of life support training.","Airway","Supportive","All Professions",false,{"$f":"IF(Table5[[#This Row],[Complete ]],\"Complete\",\"Pending\")","v":"Pending"}]
{"$rows_left_out":363}
{"sheet":"Intervention and Rehabilitation","index":4,"n_rows":396,"n_cols":13,"rows_kept":396,"cut":false,"hidden":false,"merged":[[0,0,2,11],[0,12,2,23]]}
["Interventions and Rehabiliation "]
[]
[]
[]
[]
[null,"Capability statement ","Area ","Level ","Profession ","Complete ","Progress","Signed ","Dated","Evidence ","Evidence 2","Evidence 3","Evidence 4"]
[null,"Perform active airway clearance techniques with spontaneously breathing patients who are maintaining their own airway.","Airway ","Assistive","Physio",true,{"$f":"IF(Table59[[#This Row],[Complete ]],\"Complete\",\"Pending\")","v":"Complete"},null,"2025-10-07"]
[null,"Perform active airway clearance techniques with spontaneously breathing patients who are maintaining their own airway.","Airway ","Assistive","ODP ",true,{"$f":"IF(Table59[[#This Row],[Complete ]],\"Complete\",\"Pending\")","v":"Complete"},null,"2025-10-07"]
[null,"Select the equipment required to suction a patient's airway with a Yankauer suction device or suction catheter.","Airway ","Assistive","Physio",true,{"$f":"IF(Table59[[#This Row],[Complete ]],\"Complete\",\"Pending\")","v":"Complete"},null,"2025-10-07"]
[null,"Select the equipment required to suction a patient's airway with a Yankauer suction device or suction catheter.","Airway ","Assistive","ODP ",true,{"$f":"IF(Table59[[#This Row],[Complete ]],\"Complete\",\"Pending\")","v":"Complete"},null,"2025-10-07"]
{"$rows_left_out":387}
{"sheet":"Governance and safety stadards ","index":5,"n_rows":58,"n_cols":13,"rows_kept":58,"cut":false,"hidden":false,"merged":[[0,1,2,11],[0,12,2,23]]}
[null,"Governance & Safety "]
[]
[]
[null,"Standards "]
[]
[null,null,"Capability statement ","Area ","Level ","Complete ","Progress","Signed ","Dated","Evidence ","Evidence 2","Evidence 3","Evidence 4"]
[null,null,"Keeps complete, clear, accurate and timely records, utilising digital platforms as required.","Legal & ethical","Supportive ",true,{"$f":"IF(Table59102[[#This Row],[Complete ]],\"Complete\",\"Pending\")","v":"Complete"},null,"2025-10-08"]
[null,null,"Act with integrity and honesty, ensuring individuals do not experience harm by reporting situations, behaviours or errors that cause an adverse outcome or lead to a near miss.","Legal & ethical","Supportive ",true,{"$f":"IF(Table59102[[#This Row],[Complete ]],\"Complete\",\"Pending\")","v":"Complete"},null,"2025-10-08"]
[null,null,"Report own interventions in full, clear and accurate medical records in accordance with applicable legislation, protocols and guidelines","Legal & ethical","Foundation",false,{"$f":"IF(Table59102[[#This Row],[Complete ]],\"Complete\",\"Pending\")","v":"Pending"}]
[null,null,"Contribute to duty of candour conversations with patients or, where appropriate, their families and carers, when things have gone wrong.","Legal & ethical","Foundation",false,{"$f":"IF(Table59102[[#This Row],[Complete ]],\"Complete\",\"Pending\")","v":"Pending"}]
{"$rows_left_out":49}
{"sheet":"Patient Centred Care ","index":6,"n_rows":123,"n_cols":14,"rows_kept":123,"cut":false,"hidden":false,"merged":[[0,0,2,11],[0,12,2,22]]}
["Patient Centred care "]
[]
[]
[]
[]
[null,"Capability statement ","Area ","Level ","Profession ","Complete ","Progress","Signed ","Dated","Evidence ","Evidence 2","Evidence 3","Evidence 4","Level sorted "]
[null,"Recognise the impact of a critical care admission on patients, families and carers, providing basic explanation of rehabilitation interventions.","Communication","Supportive ","All professions ",true,{"$f":"IF(Table5910[[#This Row],[Complete ]],\"Complete\",\"Pending\")","v":"Complete"},null,"2025-10-07",null,null,null,null,{"$f":"REPT(_xlfn.UNICHAR(8203),_xlfn.XMATCH(Table5910[[#This Row],[Level ]],#REF!,3))&Table5910[[#This Row],[Level ]]","v":{"$error":"#REF!"}}]
[null,"Assist conversations by adapting and modifying information in ways that are appropriate to the individual's cultural, language and communication needs.","Communication","Supportive ","All professions ",false,{"$f":"IF(Table5910[[#This Row],[Complete ]],\"Complete\",\"Pending\")","v":"Pending"},null,null,null,null,null,null,{"$f":"REPT(_xlfn.UNICHAR(8203),_xlfn.XMATCH(Table5910[[#This Row],[Level ]],#REF!,3))&Table5910[[#This Row],[Level ]]","v":{"$error":"#REF!"}}]
[null,"Recognise and use of all methods and forms of communication, ensuring individuals feel valued, respected and have opportunities to meaningfully participate.","Communication","Supportive ","All professions ",false,{"$f":"IF(Table5910[[#This Row],[Complete ]],\"Complete\",\"Pending\")","v":"Pending"},null,null,null,null,null,null,{"$f":"REPT(_xlfn.UNICHAR(8203),_xlfn.XMATCH(Table5910[[#This Row],[Level ]],#REF!,3))&Table5910[[#This Row],[Level ]]","v":{"$error":"#REF!"}}]
[null,"Effectively communicate to build and maintain relationships within the multi-professional team, actively listening, requesting, and sharing information appropriately and efficiently to enhance patient care.","Communication","Supportive ","All professions ",false,{"$f":"IF(Table5910[[#This Row],[Complete ]],\"Complete\",\"Pending\")","v":"Pending"},null,null,null,null,null,null,{"$f":"REPT(_xlfn.UNICHAR(8203),_xlfn.XMATCH(Table5910[[#This Row],[Level ]],#REF!,3))&Table5910[[#This Row],[Level ]]","v":{"$error":"#REF!"}}]
{"$rows_left_out":114}
{"sheet":"Education ","index":7,"n_rows":99,"n_cols":14,"rows_kept":99,"cut":false,"hidden":false,"merged":[[0,0,2,11],[0,12,2,23]]}
["Education "]
[]
[]
[]
[]
[null,"Capability statement ","Area ","Level ","Profession ","Complete ","Progress","Signed ","Dated","Evidence ","Evidence 2","Evidence 3","Evidence 4","Level Sorted "]
[null,"Actively participate in continuing professional development and record own learning and personal development.","Self development","Supportive","All professions",true,{"$f":"IF(Table59104[[#This Row],[Complete ]],\"Complete\",\"Pending\")","v":"Complete"},null,"2025-10-07",null,null,null,null,{"$f":"REPT(_xlfn.UNICHAR(8203),_xlfn.XMATCH(Table59104[[#This Row],[Level ]],#REF!,0+2))&Table59104[[#This Row],[Level ]]","v":{"$error":"#REF!"}}]
[null,"Recognise and articulate own learning needs across the four pillars of practice, through self-reflection, supervision and evaluation of practice.","Self development","Supportive","All professions",false,{"$f":"IF(Table59104[[#This Row],[Complete ]],\"Complete\",\"Pending\")","v":"Pending"},null,null,null,null,null,null,{"$f":"REPT(_xlfn.UNICHAR(8203),_xlfn.XMATCH(Table59104[[#This Row],[Level ]],#REF!,0+2))&Table59104[[#This Row],[Level ]]","v":{"$error":"#REF!"}}]
[null,"Identify own learning and personal development.","Self development","Supportive","All professions",false,{"$f":"IF(Table59104[[#This Row],[Complete ]],\"Complete\",\"Pending\")","v":"Pending"},null,null,null,null,null,null,{"$f":"REPT(_xlfn.UNICHAR(8203),_xlfn.XMATCH(Table59104[[#This Row],[Level ]],#REF!,0+2))&Table59104[[#This Row],[Level ]]","v":{"$error":"#REF!"}}]
[null,"Perform work-based learning to widen practical skills and knowledge.","Self development","Supportive","All professions",false,{"$f":"IF(Table59104[[#This Row],[Complete ]],\"Complete\",\"Pending\")","v":"Pending"},null,null,null,null,null,null,{"$f":"REPT(_xlfn.UNICHAR(8203),_xlfn.XMATCH(Table59104[[#This Row],[Level ]],#REF!,0+2))&Table59104[[#This Row],[Level ]]","v":{"$error":"#REF!"}}]
{"$rows_left_out":90}
{"sheet":"Leadership ","index":8,"n_rows":126,"n_cols":13,"rows_kept":126,"cut":false,"hidden":false,"merged":[[0,0,2,9],[0,10,2,21]]}
["Leadership "]
[]
[]
[]
[]
[null,"Capability statement ","Area ","Level ","Profession ","Complete ","Progress","Signed ","Dated","Evidence ","Evidence 2","Evidence 3","Evidence 4"]
[null,"Contribute to appropriate local initiatives through collaboration and sharing information and ideas.","Collaborative working","Supportive","All Professions",true,{"$f":"IF(Table5910457[[#This Row],[Complete ]],\"Complete\",\"Pending\")","v":"Complete"},null,"2025-10-07"]
[null,"Support team collaboration by demonstrating the principles of team working and culture.","Collaborative working","Supportive","All Professions",false,{"$f":"IF(Table5910457[[#This Row],[Complete ]],\"Complete\",\"Pending\")","v":"Pending"}]
[null,"Support the effective performance of teams by identifying enablers of and barriers to collaborative working, and use this information to identify solutions.","Collaborative working","Assistive","All Professions",false,{"$f":"IF(Table5910457[[#This Row],[Complete ]],\"Complete\",\"Pending\")","v":"Pending"}]
[null,"Manage and maintain positive, appropriate team relationships, demonstrating kindness, respect and compassion.","Collaborative working","Assistive","All Professions",false,{"$f":"IF(Table5910457[[#This Row],[Complete ]],\"Complete\",\"Pending\")","v":"Pending"}]
{"$rows_left_out":117}
{"sheet":"Research ","index":9,"n_rows":116,"n_cols":13,"rows_kept":116,"cut":false,"hidden":false,"merged":[[0,0,2,10],[0,11,2,22]]}
["Research "]
[]
[]
[]
[]
[null,"Capability statement ","Area ","Level ","Profession ","Complete ","Progress","Signed ","Dated","Evidence ","Evidence 2","Evidence 3","Evidence 4"]
[null,"Recognise the importance of evidence-informed practice and an awareness of where to find relevant sources of evidence.","Evidence-informed practice","Supportive","All Professions",true,{"$f":"IF(Table591045[[#This Row],[Complete ]],\"Complete\",\"Pending\")","v":"Complete"},null,"2025-10-07"]
[null,"Perform literature searches to support evidence-informed practice, under the guidance of registered healthcare professionals.","Evidence-informed practice","Assistive","All Professions",true,{"$f":"IF(Table591045[[#This Row],[Complete ]],\"Complete\",\"Pending\")","v":"Complete"},null,"2025-10-07"]
[null,"Apply knowledge and understanding of evidence-based and evidence-informed practice to critical care.","Evidence-informed practice","Foundation","All Professions",false,{"$f":"IF(Table591045[[#This Row],[Complete ]],\"Complete\",\"Pending\")","v":"Pending"}]
[null,"Utilise evidence-informed approaches to clinical practice and teaching.","Evidence-informed practice","Foundation","All Professions",false,{"$f":"IF(Table591045[[#This Row],[Complete ]],\"Complete\",\"Pending\")","v":"Pending"}]
{"$rows_left_out":107}
{"sheet":"Tables Lists ","index":10,"n_rows":17,"n_cols":9,"rows_kept":17,"cut":false,"hidden":true,"merged":[]}
["Clinical assment ",null,null,"Interventions ",null,null,"Professions ",null,"Levels "]
["Breathing",null,null,"Deterioration intervention",null,null,"All professions ",null,"Foundation"]
["Circulation",null,null,"Non-physical function",null,null,"Physio",null,"Advanced "]
["Disability",null,null,"Patient transfer",null,null,"SLT",null,"Assistive "]
["Exposure",null,null,"Pharmacology",null,null,"OT",null,"Consultant "]
["Recognition of deterioration",null,null,"Airway ",null,null,"Dietitian",null,"Enhanced "]
["Fluids",null,null,"Breathing ",null,null,"ODP ",null,"Supportive "]
["Non-physical function",null,null,"Circulation "]
["Nutrtion",null,null,"Communication intervention"]
["Screening",null,null,"Eating, drinking and swallowing "]
{"$rows_left_out":7}